Resource
type: Class
comment: RDF Schema for RDDL: 2001-01-29
subclass of: Bag
subclass of: Statement

arcrole
type: Property
comment: xlink:arcrole is a property of the rddl:resource Class
domain: resource
range: Resource
sub property of: predicate

role
type: Property
comment: xlink:role is a property of the rddl:resource Class
domain: resource
range: Resource
value: resource

purpose
type: Property
comment: Purpose is derived from xlink:arcrole
sub property of: arcrole

href
type: Property
comment: xlink:href is a property of the rddl:resource Class
domain: resource
range: Resource
sub property of: object

title
type: Property
comment: xlink:title is a property of the rddl:resource Class
domain: resource
range: Literal

type
type: Property
comment: xlink:type defaults to 'simple' is a property of the rddl:resource Class
domain: resource
value: simple
item: simple
item: extended
item: locator
item: resource
item: arc

xml:base
type: Property
comment: xml:base is a property of the rddl:resource Class
domain: resource
range: Resource

xml:lang
type: Property
comment: xml:lang is a property of the rddl:resource Class
domain: resource
range: Literal